Module11 TestNG part 6 firing the command mvn test site then error occurs.could you please help me where I went wrong | Selenium Forum

Module11 TestNG part 6 firing the command mvn test site then error occurs.could you please help me where I went wrong

K
Kuladeep Post on 12/02/2020


D:\Selenium 3.14\SeleniumPractice\learntestng1>mvn test site
[INFO] Scanning for projects...
[WARNING]
[WARNING] Some problems were encountered while building the effective model for com.learntestng:learntestng1:jar:1
[WARNING] 'build.plugins.plugin.version' for org.apache.maven.plugins:maven-surefire-plugin is missing. @ line 35, column 9
[WARNING]
[WARNING] It is highly recommended to fix these problems because they threaten the stability of your build.
[WARNING]
[WARNING] For this reason, future Maven versions might no longer support building such malformed projects.
[WARNING]
[INFO]
[INFO] --------------------< com.learntestng:learntestng1 >--------------------
[INFO] Building learntestng1 1
[INFO] --------------------------------[ jar ]---------------------------------
[INFO]
[INFO] --- maven-resources-plugin:2.6:resources (default-resources) @ learntestng1 ---
[INFO] Using 'UTF-8' encoding to copy filtered resources.
[INFO] skip non existing resourceDirectory D:\Selenium 3.14\SeleniumPractice\learntestng1\src\main\resources
[INFO]
[INFO] --- maven-compiler-plugin:3.1:compile (default-compile) @ learntestng1 ---
[INFO] Nothing to compile - all classes are up to date
[INFO]
[INFO] --- maven-resources-plugin:2.6:testResources (default-testResources) @ learntestng1 ---
[INFO] Using 'UTF-8' encoding to copy filtered resources.
[INFO] skip non existing resourceDirectory D:\Selenium 3.14\SeleniumPractice\learntestng1\src\test\resources
[INFO]
[INFO] --- maven-compiler-plugin:3.1:testCompile (default-testCompile) @ learntestng1 ---
[INFO] Changes detected - recompiling the module!
[INFO] Compiling 1 source file to D:\Selenium 3.14\SeleniumPractice\learntestng1\target\test-classes
[INFO]
[INFO] --- maven-surefire-plugin:2.12.4:test (default-test) @ learntestng1 ---
[INFO] Surefire report directory: D:\Selenium 3.14\SeleniumPractice\learntestng1\target\surefire-reports

-------------------------------------------------------
T E S T S
-------------------------------------------------------
Running com.learntestng.AppTest
Configuring TestNG with: org.apache.maven.surefire.testng.conf.TestNG652Configurator@3d82c5f3
*********App Test***********
Tests run: 1, Failures: 0, Errors: 0, Skipped: 0, Time elapsed: 1.765 sec

Results :

Tests run: 1, Failures: 0, Errors: 0, Skipped: 0

[INFO]
[INFO] --- maven-site-plugin:3.3:site (default-site) @ learntestng1 ---
[WARNING] Report plugin org.apache.maven.plugins:maven-project-info-reports-plugin has an empty version.
[WARNING]
[WARNING] It is highly recommended to fix these problems because they threaten the stability of your build.
[WARNING]
[WARNING] For this reason, future Maven versions might no longer support building such malformed projects.
[INFO] configuring report plugin org.apache.maven.plugins:maven-project-info-reports-plugin:3.0.0
[WARNING] Error injecting: org.apache.maven.report.projectinfo.CiManagementReport
java.lang.NoClassDefFoundError: org/apache/maven/doxia/siterenderer/DocumentContent
at java.lang.Class.getDeclaredConstructors0 (Native Method)
at java.lang.Class.privateGetDeclaredConstructors (Class.java:2658)
at java.lang.Class.getDeclaredConstructors (Class.java:2007)
at com.google.inject.spi.InjectionPoint.forConstructorOf (InjectionPoint.java:245)
at com.google.inject.internal.ConstructorBindingImpl.create (ConstructorBindingImpl.java:115)
at com.google.inject.internal.InjectorImpl.createUninitializedBinding (InjectorImpl.java:706)
at com.google.inject.internal.InjectorImpl.createJustInTimeBinding (InjectorImpl.java:930)
at com.google.inject.internal.InjectorImpl.createJustInTimeBindingRecursive (InjectorImpl.java:852)
at com.google.inject.internal.InjectorImpl.getJustInTimeBinding (InjectorImpl.java:291)
at com.google.inject.internal.InjectorImpl.getBindingOrThrow (InjectorImpl.java:222)
at com.google.inject.internal.InjectorImpl.getProviderOrThrow (InjectorImpl.java:1040)
at com.google.inject.internal.InjectorImpl.getProvider (InjectorImpl.java:1071)
at com.google.inject.internal.InjectorImpl.getProvider (InjectorImpl.java:1034)
at com.google.inject.internal.InjectorImpl.getInstance (InjectorImpl.java:1086)
at org.eclipse.sisu.space.AbstractDeferredClass.get (AbstractDeferredClass.java:48)
at com.google.inject.internal.ProviderInternalFactory.provision (ProviderInternalFactory.java:85)
at com.google.inject.internal.InternalFactoryToInitializableAdapter.provision (InternalFactoryToInitializableAdapter.java:57)
at com.google.inject.internal.ProviderInternalFactory$1.call (ProviderInternalFactory.java:66)
at com.google.inject.internal.ProvisionListenerStackCallback$Provision.provision (ProvisionListenerStackCallback.java:112)
at com.google.inject.internal.ProvisionListenerStackCallback$Provision.provision (ProvisionListenerStackCallback.java:127)
at com.google.inject.internal.ProvisionListenerStackCallback.provision (ProvisionListenerStackCallback.java:66)
at com.google.inject.internal.ProviderInternalFactory.circularGet (ProviderInternalFactory.java:61)
at com.google.inject.internal.InternalFactoryToInitializableAdapter.get (InternalFactoryToInitializableAdapter.java:47)
at com.google.inject.internal.InjectorImpl$1.get (InjectorImpl.java:1050)
at org.eclipse.sisu.inject.Guice4$1.get (Guice4.java:162)
at org.eclipse.sisu.inject.LazyBeanEntry.getValue (LazyBeanEntry.java:81)
at org.eclipse.sisu.plexus.LazyPlexusBean.getValue (LazyPlexusBean.java:51)
at org.codehaus.plexus.DefaultPlexusContainer.lookup (DefaultPlexusContainer.java:263)
at org.codehaus.plexus.DefaultPlexusContainer.lookup (DefaultPlexusContainer.java:255)
at org.apache.maven.plugin.internal.DefaultMavenPluginManager.getConfiguredMojo (DefaultMavenPluginManager.java:520)
at org.apache.maven.reporting.exec.DefaultMavenReportExecutor.getConfiguredMavenReport (DefaultMavenReportExecutor.java:306)
at org.apache.maven.reporting.exec.DefaultMavenReportExecutor.buildReportPlugin (DefaultMavenReportExecutor.java:263)
at org.apache.maven.reporting.exec.DefaultMavenReportExecutor.buildMavenReports (DefaultMavenReportExecutor.java:154)
at org.apache.maven.plugins.site.AbstractSiteRenderingMojo.getReports (AbstractSiteRenderingMojo.java:235)
at org.apache.maven.plugins.site.SiteMojo.execute (SiteMojo.java:121)
at org.apache.maven.plugin.DefaultBuildPluginManager.executeMojo (DefaultBuildPluginManager.java:137)
at org.apache.maven.lifecycle.internal.MojoExecutor.execute (MojoExecutor.java:210)
at org.apache.maven.lifecycle.internal.MojoExecutor.execute (MojoExecutor.java:156)
at org.apache.maven.lifecycle.internal.MojoExecutor.execute (MojoExecutor.java:148)
at org.apache.maven.lifecycle.internal.LifecycleModuleBuilder.buildProject (LifecycleModuleBuilder.java:117)
at org.apache.maven.lifecycle.internal.LifecycleModuleBuilder.buildProject (LifecycleModuleBuilder.java:81)
at org.apache.maven.lifecycle.internal.builder.singlethreaded.SingleThreadedBuilder.build (SingleThreadedBuilder.java:56)
at org.apache.maven.lifecycle.internal.LifecycleStarter.execute (LifecycleStarter.java:128)
at org.apache.maven.DefaultMaven.doExecute (DefaultMaven.java:305)
at org.apache.maven.DefaultMaven.doExecute (DefaultMaven.java:192)
at org.apache.maven.DefaultMaven.execute (DefaultMaven.java:105)
at org.apache.maven.cli.MavenCli.execute (MavenCli.java:956)
at org.apache.maven.cli.MavenCli.doMain (MavenCli.java:288)
at org.apache.maven.cli.MavenCli.main (MavenCli.java:192)
at sun.reflect.NativeMethodAccessorImpl.invoke0 (Native Method)
at sun.reflect.NativeMethodAccessorImpl.invoke (NativeMethodAccessorImpl.java:62)
at sun.reflect.DelegatingMethodAccessorImpl.invoke (DelegatingMethodAccessorImpl.java:43)
at java.lang.reflect.Method.invoke (Method.java:483)
at org.codehaus.plexus.classworlds.launcher.Launcher.launchEnhanced (Launcher.java:282)
at org.codehaus.plexus.classworlds.launcher.Launcher.launch (Launcher.java:225)
at org.codehaus.plexus.classworlds.launcher.Launcher.mainWithExitCode (Launcher.java:406)
at org.codehaus.plexus.classworlds.launcher.Launcher.main (Launcher.java:347)
Caused by: java.lang.ClassNotFoundException: org.apache.maven.doxia.siterenderer.DocumentContent
at org.codehaus.plexus.classworlds.strategy.SelfFirstStrategy.loadClass (SelfFirstStrategy.java:50)
at org.codehaus.plexus.classworlds.realm.ClassRealm.unsynchronizedLoadClass (ClassRealm.java:271)
at org.codehaus.plexus.classworlds.realm.ClassRealm.loadClass (ClassRealm.java:247)
at org.codehaus.plexus.classworlds.realm.ClassRealm.loadClass (ClassRealm.java:239)
at java.lang.Class.getDeclaredConstructors0 (Native Method)
at java.lang.Class.privateGetDeclaredConstructors (Class.java:2658)
at java.lang.Class.getDeclaredConstructors (Class.java:2007)
at com.google.inject.spi.InjectionPoint.forConstructorOf (InjectionPoint.java:245)
at com.google.inject.internal.ConstructorBindingImpl.create (ConstructorBindingImpl.java:115)
at com.google.inject.internal.InjectorImpl.createUninitializedBinding (InjectorImpl.java:706)
at com.google.inject.internal.InjectorImpl.createJustInTimeBinding (InjectorImpl.java:930)
at com.google.inject.internal.InjectorImpl.createJustInTimeBindingRecursive (InjectorImpl.java:852)
at com.google.inject.internal.InjectorImpl.getJustInTimeBinding (InjectorImpl.java:291)
at com.google.inject.internal.InjectorImpl.getBindingOrThrow (InjectorImpl.java:222)
at com.google.inject.internal.InjectorImpl.getProviderOrThrow (InjectorImpl.java:1040)
at com.google.inject.internal.InjectorImpl.getProvider (InjectorImpl.java:1071)
at com.google.inject.internal.InjectorImpl.getProvider (InjectorImpl.java:1034)
at com.google.inject.internal.InjectorImpl.getInstance (InjectorImpl.java:1086)
at org.eclipse.sisu.space.AbstractDeferredClass.get (AbstractDeferredClass.java:48)
at com.google.inject.internal.ProviderInternalFactory.provision (ProviderInternalFactory.java:85)
at com.google.inject.internal.InternalFactoryToInitializableAdapter.provision (InternalFactoryToInitializableAdapter.java:57)
at com.google.inject.internal.ProviderInternalFactory$1.call (ProviderInternalFactory.java:66)
at com.google.inject.internal.ProvisionListenerStackCallback$Provision.provision (ProvisionListenerStackCallback.java:112)
at com.google.inject.internal.ProvisionListenerStackCallback$Provision.provision (ProvisionListenerStackCallback.java:127)
at com.google.inject.internal.ProvisionListenerStackCallback.provision (ProvisionListenerStackCallback.java:66)
at com.google.inject.internal.ProviderInternalFactory.circularGet (ProviderInternalFactory.java:61)
at com.google.inject.internal.InternalFactoryToInitializableAdapter.get (InternalFactoryToInitializableAdapter.java:47)
at com.google.inject.internal.InjectorImpl$1.get (InjectorImpl.java:1050)
at org.eclipse.sisu.inject.Guice4$1.get (Guice4.java:162)
at org.eclipse.sisu.inject.LazyBeanEntry.getValue (LazyBeanEntry.java:81)
at org.eclipse.sisu.plexus.LazyPlexusBean.getValue (LazyPlexusBean.java:51)
at org.codehaus.plexus.DefaultPlexusContainer.lookup (DefaultPlexusContainer.java:263)
at org.codehaus.plexus.DefaultPlexusContainer.lookup (DefaultPlexusContainer.java:255)
at org.apache.maven.plugin.internal.DefaultMavenPluginManager.getConfiguredMojo (DefaultMavenPluginManager.java:520)
at org.apache.maven.reporting.exec.DefaultMavenReportExecutor.getConfiguredMavenReport (DefaultMavenReportExecutor.java:306)
at org.apache.maven.reporting.exec.DefaultMavenReportExecutor.buildReportPlugin (DefaultMavenReportExecutor.java:263)
at org.apache.maven.reporting.exec.DefaultMavenReportExecutor.buildMavenReports (DefaultMavenReportExecutor.java:154)
at org.apache.maven.plugins.site.AbstractSiteRenderingMojo.getReports (AbstractSiteRenderingMojo.java:235)
at org.apache.maven.plugins.site.SiteMojo.execute (SiteMojo.java:121)
at org.apache.maven.plugin.DefaultBuildPluginManager.executeMojo (DefaultBuildPluginManager.java:137)
at org.apache.maven.lifecycle.internal.MojoExecutor.execute (MojoExecutor.java:210)
at org.apache.maven.lifecycle.internal.MojoExecutor.execute (MojoExecutor.java:156)
at org.apache.maven.lifecycle.internal.MojoExecutor.execute (MojoExecutor.java:148)
at org.apache.maven.lifecycle.internal.LifecycleModuleBuilder.buildProject (LifecycleModuleBuilder.java:117)
at org.apache.maven.lifecycle.internal.LifecycleModuleBuilder.buildProject (LifecycleModuleBuilder.java:81)
at org.apache.maven.lifecycle.internal.builder.singlethreaded.SingleThreadedBuilder.build (SingleThreadedBuilder.java:56)
at org.apache.maven.lifecycle.internal.LifecycleStarter.execute (LifecycleStarter.java:128)
at org.apache.maven.DefaultMaven.doExecute (DefaultMaven.java:305)
at org.apache.maven.DefaultMaven.doExecute (DefaultMaven.java:192)
at org.apache.maven.DefaultMaven.execute (DefaultMaven.java:105)
at org.apache.maven.cli.MavenCli.execute (MavenCli.java:956)
at org.apache.maven.cli.MavenCli.doMain (MavenCli.java:288)
at org.apache.maven.cli.MavenCli.main (MavenCli.java:192)
at sun.reflect.NativeMethodAccessorImpl.invoke0 (Native Method)
at sun.reflect.NativeMethodAccessorImpl.invoke (NativeMethodAccessorImpl.java:62)
at sun.reflect.DelegatingMethodAccessorImpl.invoke (DelegatingMethodAccessorImpl.java:43)
at java.lang.reflect.Method.invoke (Method.java:483)
at org.codehaus.plexus.classworlds.launcher.Launcher.launchEnhanced (Launcher.java:282)
at org.codehaus.plexus.classworlds.launcher.Launcher.launch (Launcher.java:225)
at org.codehaus.plexus.classworlds.launcher.Launcher.mainWithExitCode (Launcher.java:406)
at org.codehaus.plexus.classworlds.launcher.Launcher.main (Launcher.java:347)
[INFO] ------------------------------------------------------------------------
[INFO] BUILD FAILURE
[INFO] ------------------------------------------------------------------------
[INFO] Total time: 19.817 s
[INFO] Finished at: 2020-02-11T18:12:52-06:00
[INFO] ------------------------------------------------------------------------
[ERROR] Failed to execute goal org.apache.maven.plugins:maven-site-plugin:3.3:site (default-site) on project learntestng1: Execution default-site of goal org.apache.maven.plugins:maven-site-plugin:3.3:site failed: A required class was missing while executing org.apache.maven.plugins:maven-site-plugin:3.3:site: org/apache/maven/doxia/siterenderer/DocumentContent
[ERROR] -----------------------------------------------------
[ERROR] realm = plugin>org.apache.maven.plugins:maven-site-plugin:3.3
[ERROR] strategy = org.codehaus.plexus.classworlds.strategy.SelfFirstStrategy
[ERROR] urls[0] = file:/C:/Users/anith/.m2/repository/org/apache/maven/plugins/maven-site-plugin/3.3/maven-site-plugin-3.3.jar
[ERROR] urls[1] = file:/C:/Users/anith/.m2/repository/org/apache/maven/reporting/maven-reporting-exec/1.1/maven-reporting-exec-1.1.jar
[ERROR] urls[2] = file:/C:/Users/anith/.m2/repository/org/apache/maven/reporting/maven-reporting-api/3.0/maven-reporting-api-3.0.jar
[ERROR] urls[3] = file:/C:/Users/anith/.m2/repository/org/apache/maven/shared/maven-shared-utils/0.3/maven-shared-utils-0.3.jar
[ERROR] urls[4] = file:/C:/Users/anith/.m2/repository/com/google/code/findbugs/jsr305/2.0.1/jsr305-2.0.1.jar
[ERROR] urls[5] = file:/C:/Users/anith/.m2/repository/org/codehaus/plexus/plexus-component-annotations/1.5.5/plexus-component-annotations-1.5.5.jar
[ERROR] urls[6] = file:/C:/Users/anith/.m2/repository/org/sonatype/aether/aether-util/1.7/aether-util-1.7.jar
[ERROR] urls[7] = file:/C:/Users/anith/.m2/repository/org/eclipse/aether/aether-util/0.9.0.M2/aether-util-0.9.0.M2.jar
[ERROR] urls[8] = file:/C:/Users/anith/.m2/repository/org/sonatype/sisu/sisu-inject-bean/1.4.2/sisu-inject-bean-1.4.2.jar
[ERROR] urls[9] = file:/C:/Users/anith/.m2/repository/org/sonatype/sisu/sisu-guice/2.1.7/sisu-guice-2.1.7-noaop.jar
[ERROR] urls[10] = file:/C:/Users/anith/.m2/repository/org/codehaus/plexus/plexus-interpolation/1.14/plexus-interpolation-1.14.jar
[ERROR] urls[11] = file:/C:/Users/anith/.m2/repository/org/sonatype/plexus/plexus-sec-dispatcher/1.3/plexus-sec-dispatcher-1.3.jar
[ERROR] urls[12] = file:/C:/Users/anith/.m2/repository/org/sonatype/plexus/plexus-cipher/1.4/plexus-cipher-1.4.jar
[ERROR] urls[13] = file:/C:/Users/anith/.m2/repository/org/apache/maven/maven-archiver/2.4.2/maven-archiver-2.4.2.jar
[ERROR] urls[14] = file:/C:/Users/anith/.m2/repository/org/apache/maven/doxia/doxia-sink-api/1.4/doxia-sink-api-1.4.jar
[ERROR] urls[15] = file:/C:/Users/anith/.m2/repository/org/apache/maven/doxia/doxia-logging-api/1.4/doxia-logging-api-1.4.jar
[ERROR] urls[16] = file:/C:/Users/anith/.m2/repository/junit/junit/3.8.1/junit-3.8.1.jar
[ERROR] urls[17] = file:/C:/Users/anith/.m2/repository/org/apache/maven/doxia/doxia-core/1.4/doxia-core-1.4.jar
[ERROR] urls[18] = file:/C:/Users/anith/.m2/repository/xerces/xercesImpl/2.9.1/xercesImpl-2.9.1.jar
[ERROR] urls[19] = file:/C:/Users/anith/.m2/repository/xml-apis/xml-apis/1.3.04/xml-apis-1.3.04.jar
[ERROR] urls[20] = file:/C:/Users/anith/.m2/repository/org/apache/httpcomponents/httpclient/4.0.2/httpclient-4.0.2.jar
[ERROR] urls[21] = file:/C:/Users/anith/.m2/repository/commons-logging/commons-logging/1.1.1/commons-logging-1.1.1.jar
[ERROR] urls[22] = file:/C:/Users/anith/.m2/repository/commons-codec/commons-codec/1.3/commons-codec-1.3.jar
[ERROR] urls[23] = file:/C:/Users/anith/.m2/repository/org/apache/httpcomponents/httpcore/4.0.1/httpcore-4.0.1.jar
[ERROR] urls[24] = file:/C:/Users/anith/.m2/repository/org/apache/maven/doxia/doxia-module-xhtml/1.4/doxia-module-xhtml-1.4.jar
[ERROR] urls[25] = file:/C:/Users/anith/.m2/repository/org/apache/maven/doxia/doxia-module-apt/1.4/doxia-module-apt-1.4.jar
[ERROR] urls[26] = file:/C:/Users/anith/.m2/repository/org/apache/maven/doxia/doxia-module-xdoc/1.4/doxia-module-xdoc-1.4.jar
[ERROR] urls[27] = file:/C:/Users/anith/.m2/repository/org/apache/maven/doxia/doxia-module-fml/1.4/doxia-module-fml-1.4.jar
[ERROR] urls[28] = file:/C:/Users/anith/.m2/repository/org/apache/maven/doxia/doxia-module-markdown/1.4/doxia-module-markdown-1.4.jar
[ERROR] urls[29] = file:/C:/Users/anith/.m2/repository/org/pegdown/pegdown/1.2.1/pegdown-1.2.1.jar
[ERROR] urls[30] = file:/C:/Users/anith/.m2/repository/org/parboiled/parboiled-java/1.1.4/parboiled-java-1.1.4.jar
[ERROR] urls[31] = file:/C:/Users/anith/.m2/repository/org/parboiled/parboiled-core/1.1.4/parboiled-core-1.1.4.jar
[ERROR] urls[32] = file:/C:/Users/anith/.m2/repository/org/ow2/asm/asm/4.1/asm-4.1.jar
[ERROR] urls[33] = file:/C:/Users/anith/.m2/repository/org/ow2/asm/asm-tree/4.1/asm-tree-4.1.jar
[ERROR] urls[34] = file:/C:/Users/anith/.m2/repository/org/ow2/asm/asm-analysis/4.1/asm-analysis-4.1.jar
[ERROR] urls[35] = file:/C:/Users/anith/.m2/repository/org/ow2/asm/asm-util/4.1/asm-util-4.1.jar
[ERROR] urls[36] = file:/C:/Users/anith/.m2/repository/javax/servlet/servlet-api/2.5/servlet-api-2.5.jar
[ERROR] urls[37] = file:/C:/Users/anith/.m2/repository/org/apache/maven/doxia/doxia-decoration-model/1.4/doxia-decoration-model-1.4.jar
[ERROR] urls[38] = file:/C:/Users/anith/.m2/repository/org/apache/maven/doxia/doxia-site-renderer/1.4/doxia-site-renderer-1.4.jar
[ERROR] urls[39] = file:/C:/Users/anith/.m2/repository/org/apache/velocity/velocity-tools/2.0/velocity-tools-2.0.jar
[ERROR] urls[40] = file:/C:/Users/anith/.m2/repository/commons-beanutils/commons-beanutils/1.7.0/commons-beanutils-1.7.0.jar
[ERROR] urls[41] = file:/C:/Users/anith/.m2/repository/commons-digester/commons-digester/1.8/commons-digester-1.8.jar
[ERROR] urls[42] = file:/C:/Users/anith/.m2/repository/commons-chain/commons-chain/1.1/commons-chain-1.1.jar
[ERROR] urls[43] = file:/C:/Users/anith/.m2/repository/commons-validator/commons-validator/1.3.1/commons-validator-1.3.1.jar
[ERROR] urls[44] = file:/C:/Users/anith/.m2/repository/dom4j/dom4j/1.1/dom4j-1.1.jar
[ERROR] urls[45] = file:/C:/Users/anith/.m2/repository/sslext/sslext/1.2-0/sslext-1.2-0.jar
[ERROR] urls[46] = file:/C:/Users/anith/.m2/repository/org/apache/struts/struts-core/1.3.8/struts-core-1.3.8.jar
[ERROR] urls[47] = file:/C:/Users/anith/.m2/repository/antlr/antlr/2.7.2/antlr-2.7.2.jar
[ERROR] urls[48] = file:/C:/Users/anith/.m2/repository/org/apache/struts/struts-taglib/1.3.8/struts-taglib-1.3.8.jar
[ERROR] urls[49] = file:/C:/Users/anith/.m2/repository/org/apache/struts/struts-tiles/1.3.8/struts-tiles-1.3.8.jar
[ERROR] urls[50] = file:/C:/Users/anith/.m2/repository/commons-collections/commons-collections/3.2.1/commons-collections-3.2.1.jar
[ERROR] urls[51] = file:/C:/Users/anith/.m2/repository/org/apache/maven/doxia/doxia-integration-tools/1.5/doxia-integration-tools-1.5.jar
[ERROR] urls[52] = file:/C:/Users/anith/.m2/repository/org/codehaus/plexus/plexus-archiver/1.0/plexus-archiver-1.0.jar
[ERROR] urls[53] = file:/C:/Users/anith/.m2/repository/org/codehaus/plexus/plexus-io/1.0/plexus-io-1.0.jar
[ERROR] urls[54] = file:/C:/Users/anith/.m2/repository/org/codehaus/plexus/plexus-i18n/1.0-beta-7/plexus-i18n-1.0-beta-7.jar
[ERROR] urls[55] = file:/C:/Users/anith/.m2/repository/org/apache/velocity/velocity/1.5/velocity-1.5.jar
[ERROR] urls[56] = file:/C:/Users/anith/.m2/repository/oro/oro/2.0.8/oro-2.0.8.jar
[ERROR] urls[57] = file:/C:/Users/anith/.m2/repository/org/codehaus/plexus/plexus-velocity/1.1.8/plexus-velocity-1.1.8.jar
[ERROR] urls[58] = file:/C:/Users/anith/.m2/repository/org/codehaus/plexus/plexus-utils/1.5.10/plexus-utils-1.5.10.jar
[ERROR] urls[59] = file:/C:/Users/anith/.m2/repository/org/mortbay/jetty/jetty/6.1.25/jetty-6.1.25.jar
[ERROR] urls[60] = file:/C:/Users/anith/.m2/repository/org/mortbay/jetty/servlet-api/2.5-20081211/servlet-api-2.5-20081211.jar
[ERROR] urls[61] = file:/C:/Users/anith/.m2/repository/org/mortbay/jetty/jetty-util/6.1.25/jetty-util-6.1.25.jar
[ERROR] urls[62] = file:/C:/Users/anith/.m2/repository/commons-lang/commons-lang/2.5/commons-lang-2.5.jar
[ERROR] urls[63] = file:/C:/Users/anith/.m2/repository/commons-io/commons-io/1.4/commons-io-1.4.jar
[ERROR] Number of foreign imports: 1
[ERROR] import: Entry[import from realm ClassRealm[maven.api, parent: null]]
[ERROR]
[ERROR] -----------------------------------------------------
[ERROR] : org.apache.maven.doxia.siterenderer.DocumentContent
[ERROR] -> [Help 1]
[ERROR]
[ERROR] To see the full stack trace of the errors, re-run Maven with the -e switch.
[ERROR] Re-run Maven using the -X switch to enable full debug logging.
[ERROR]
[ERROR] For more information about the errors and possible solutions, please read the following articles:
[ERROR] [Help 1] http://cwiki.apache.org/confluence/display/MAVEN/PluginContainerException

S

Instructor

Support Team Reply on 12/02/2020

Have you configured your pom.xml for the test?

If you have not configured your test, you won't be able to run test cases.

K
Kuladeep 4 days go

If I give the command  mvn test then the build is success

My testcases are executed accordingly.Thanks

Related Post